{"text_format":"1","workbook":"xlsx","n_sheets":23,"sheets":["Instructions","Activities","Proposed Goals & Outcome ","Project Budget","..","Factors.","Project Budget Street Outreach","Project Budget Shelter","Project Budget RRH","Project Budget HP","Project Budget HMIS","Wage & Fringe","Staff#1","Staff#2","Staff#3","Staff#4","Staff#5","Staff#6","Staff#7","Staff#8","Staff#9","Staff#10","Equipment Disposition Request"],"not_rendered":{"charts":0,"images":1,"macros":1,"external_links":1,"defined_names":13,"comments":1,"pivot_tables":0},"unopened":[],"bounds":{"document_bytes":16777216,"sheet_cells":100000,"rows_first":2000,"rows_last":500,"rows_between":2000,"halvings":0,"cell_chars":16384,"cell_head_chars":4096},"cells_cut":0,"cells_raw":0,"read":"whole","date_system":"1900"}

{"sheet":"Instructions","index":0,"n_rows":42,"n_cols":12,"rows_kept":42,"cut":false,"hidden":false,"merged":[[10,3,10,12],[3,3,3,12],[4,3,4,12],[6,3,6,12],[7,7,7,11],[9,3,9,12],[19,3,19,12],[12,3,12,12],[13,3,13,11],[14,3,14,11],[16,3,16,12],[17,3,17,12],[18,3,18,12]]}
[]
[]
[]
[null,null,null,"MISSISSIPPI HOME CORPORATION"]
[null,null,null,"Emergency Solutions Grant Budget Form"]
[null,null,null,null,null,null,null,null,"Grant PY:"]
[null,null,null,"I. Instructions"]
[null,null,null,"Agency's Name:"]
[null,null,null,"BUDGET INSTRUCTIONS"]
[null,null,null,"_________________________________________________________________________________________"]
{"$rows_left_out":33}
{"sheet":"Activities","index":1,"n_rows":130,"n_cols":14,"rows_kept":130,"cut":false,"hidden":false,"merged":[[55,3,55,11],[1,1,1,18],[2,1,2,18],[19,3,19,6],[24,3,24,6],[33,3,33,16],[81,2,81,18],[56,4,56,17],[66,1,66,18],[68,2,68,6],[69,2,69,18],[72,3,72,18],[73,3,73,18],[74,3,74,18],[75,3,75,18],[76,3,76,18],[77,3,77,18],[80,2,80,6],[101,2,102,2],[85,3,85,18],[91,3,91,19],[92,3,92,19],[93,3,93,20],[94,2,94,6],[95,2,95,18],[96,2,96,7],[97,2,97,18],[98,2,98,18],[99,2,99,18],[100,3,100,20],[129,3,129,20],[103,3,103,20],[104,3,104,20],[105,3,105,20],[108,2,108,18],[124,4,124,20],[127,3,127,20]]}
[]
[null,"II.   ACTIVITIES"]
[null,"Activities funded under this section must comply with HUD's standards on participation, data collection, and reporting under a local HMIS.  Agencies  should review 24 CFR, Part 576 and MHC's ESG Program Description for clarification and details on services."]
[null,{"$f":"Instructions!H8","v":0}]
[]
[]
[null,null,"1.  Population to be served:  (Select all that apply)"]
[]
[null,null,null,null,null,null,null,null,null,null,null,"Domestic Violence Victims"]
[null,null,null,"Homeless individuals and/or households",null,null,null,null,null,null,null,"Individuals and/or households with serious mental illness"]
{"$rows_left_out":121}
{"sheet":"Proposed Goals & Outcome ","index":2,"n_rows":15,"n_cols":19,"rows_kept":15,"cut":false,"hidden":false,"merged":[[1,1,1,19],[2,1,2,19],[6,2,6,19],[8,9,8,10],[8,11,8,12],[8,13,8,14],[8,15,8,16],[8,17,8,18],[10,3,10,8],[11,3,11,7],[12,3,12,7],[13,3,13,7],[14,3,14,8]]}
[]
[null,"III.   PROPOSED PERFORMANCE OUTCOME MEASUREMENTS"]
[null,"Proposed Performance Outcome Measurement should reflect the needs and goals expected to be met during the activity period.  (Enter \"N/A\" for indicators that do not apply to your project)."]
[null,{"$f":"Instructions!H8","v":0}]
[]
[null,null,"Persons/Households to be Served"]
[null,null,"Enter the expected outcome for the number of persons and/or households (HH) to be served within the grant period for each quarter."]
[]
[null,null,null,null,null,null,null,null,null,"Q1",null,"Q2",null,"Q3",null,"Q4",null,"TOTAL"]
[null,null,null,null,null,null,null,null,null,"Persons","HH","Persons","HH","Persons","HH","Persons","HH","Persons","HH"]
{"$rows_left_out":6}
{"sheet":"Project Budget","index":3,"n_rows":69,"n_cols":13,"rows_kept":69,"cut":false,"hidden":false,"merged":[[67,11,69,13],[56,1,56,13],[57,2,60,13],[61,11,66,13],[11,2,11,4],[12,2,12,5],[24,10,24,12],[23,2,23,8],[23,10,23,12],[15,2,15,8],[18,2,18,8],[21,2,21,8],[24,2,24,8],[41,8,41,11],[32,2,32,6],[45,2,45,5],[3,1,3,13],[5,12,6,13],[8,12,8,13],[21,10,21,12],[22,2,22,8],[22,10,22,12],[18,10,18,12],[19,2,19,8],[19,10,19,12],[20,2,20,8],[20,10,20,12],[15,10,15,12],[16,2,16,8],[16,10,16,12],[17,2,17,8],[17,10,17,12],[6,1,6,11],[7,2,7,12],[9,2,9,4],[10,2,10,12],[14,10,14,12],[32,9,32,13],[46,2,46,5],[47,2,47,5],[41,3,41,6],[43,2,43,5],[44,2,44,5]]}
[]
[]
[null,"IV.  PROJECT BUDGET "]
[null,"The Emergency Solutions Grant funding must be used in coordination with other funding sources and programs to ensure a continuum of services.  Complete as accurately and completely as possible.  Failure to do so may result in a reduction or denial of funding.\n\n *Agencies may not receive the complete amount of requested increase in funding."]
[null,{"$f":"Instructions!H8","v":0}]
[]
[null,"Resources"]
[null,null,"**Agencies should only fill out the match section of the ESG budget modification form if they are requesting additional funds that have not been previously matched."]
[]
[null,null,"Matching Funds"]
{"$rows_left_out":60}
{"sheet":"..","index":4,"n_rows":80,"n_cols":12,"rows_kept":80,"cut":false,"hidden":true,"merged":[[69,2,69,6],[72,5,72,6],[73,5,73,6],[74,5,74,6],[3,1,3,12],[7,2,7,6],[7,8,7,11],[11,2,11,6],[14,2,14,6],[15,2,15,6],[16,2,16,6],[6,1,6,11],[17,2,17,6],[18,2,18,6],[19,2,19,6],[20,2,20,6],[21,2,21,6],[22,2,22,6],[23,2,23,6],[24,2,24,6],[27,2,27,6],[30,2,30,6],[31,2,31,6],[32,2,32,6],[33,2,33,6],[34,2,34,6],[35,2,35,6],[36,2,36,6],[37,2,37,6],[38,2,38,6],[39,2,39,6],[58,8,58,11],[46,2,46,6],[47,2,47,6],[48,2,48,6],[49,2,49,6],[50,2,50,6],[51,2,51,6],[52,2,52,6],[54,2,54,6],[55,2,55,6],[56,2,56,6],[64,2,64,7],[66,2,66,6],[40,2,40,6],[44,2,45,6],[53,2,53,6],[58,2,58,6]]}
[]
[]
[null,"VII.  PROJECT BUDGET "]
[null,"The Emergency Solutions Grant funding must be used in coordination with other funding sources and programs to ensure continuum of services.  The Proposed Budget must provide information on the organization's activities, resources, and expenditures projected for 2021-2022.  Complete as accurately and completely as possible.  Failure to do so may result in a reduction or denial of funding."]
[null,{"$f":"IF(#REF!=\"\",\"\",#REF!)","v":{"$error":"#REF!"}},null,null,null,null,null,null,null,null,null,{"$f":"#REF!","v":{"$error":"#REF!"}}]
[]
[null,"*If your agency is applying for a two-year ESG grant cycle, only provide the budget for the current (FY 2021 -2022) ESG grant year. "]
[null,null,"Anticipated Resources",null,null,null,null,null,"Amount Projected"]
[null,null,null,null,null,null,null,null,"First Quarter","Second Quarter","Third Quarter","Fourth Quarter"]
[null,null,"2021 Emergency Solutions Grant (ESG) Request:",null,null,null,null,null,0,0,0,0]
{"$rows_left_out":71}
{"sheet":"Factors.","index":5,"n_rows":88,"n_cols":20,"rows_kept":88,"cut":false,"hidden":true,"merged":[]}
[]
[]
[]
[null,"activity_type",null,null,null,null,"Counties",null,null,null,"employment",null,null,null,"support_docs",null,null,null,null,"app_yr"]
[]
[null,"Emergency Shelter",null,null,null,null,1,null,null,null,"Part-time",null,null,null,"Commitment Letter",null,null,null,null,2023]
[null,"Street Outreach",null,null,null,null,{"$f":"G6+1","v":2},"Adams",null,null,"Full-Time",null,null,null,"Award Letter",null,null,null,null,2024]
[null,"Rapid-Re-housing",null,null,null,null,3,"Alcorn",null,null,null,null,null,null,"Bank Statement"]
[null,"Homelessness Prevention",null,null,null,null,4,"Amite",null,null,null,null,null,null,"Other (Explain in Project Narrative)"]
[null,"HMIS",null,null,null,null,5,"Attala"]
{"$rows_left_out":79}
{"sheet":"Project Budget Street Outreach","index":6,"n_rows":18,"n_cols":21,"rows_kept":18,"cut":false,"hidden":false,"merged":[[1,2,1,10],[3,5,3,8],[1,12,1,20],[3,15,3,18],[6,4,12,4],[6,14,12,14]]}
[]
[null,null,"Project Expenses\nUpdated Budget",null,null,null,null,null,null,null,null,null,"Project Expenses\nOriginal Approved Budget  "]
[null,null,null,null,"HOME",null,null,null,null,null,null,null,null,null,"HOME"]
[null,null,"Street Outreach (576.101)",null,null,"Updated Budget",null,null,null,null,null,null,"Street Outreach (576.101)",null,null,"Approved Budget "]
[null,null,null,null,"Budget","Q-1","Q-2","Q-3","Q-4",null,"Total",null,null,null,"Budget","Q-1","Q-2","Q-3","Q-4",null,"Total"]
[null,null,null,null,{"$f":"F16+G16+H16+I16","v":0},null,null,null,null,null,null,null,null,null,{"$f":"P16+Q16+R16+S16","v":0}]
[null,null,"Engagement",null,null,0,0,0,0,null,{"$f":"(F7+G7+H7+I7)","v":0},null,"Engagement",null,null,0,0,0,0,null,{"$f":"(P7+Q7+R7+S7)","v":0}]
[null,null,"Case Management",null,null,0,0,0,0,null,0,null,"Case Management",null,null,0,0,0,0,null,0]
[null,null,"Emergency health services",null,null,0,0,0,0,null,0,null,"Emergency health services",null,null,0,0,0,0,null,0]
[null,null,"Emergency mental health services",null,null,0,0,0,0,null,0,null,"Emergency mental health services",null,null,0,0,0,0,null,0]
{"$rows_left_out":9}
{"sheet":"Project Budget Shelter","index":7,"n_rows":49,"n_cols":21,"rows_kept":49,"cut":false,"hidden":false,"merged":[[7,4,7,10],[28,1,31,1],[7,14,7,20],[14,4,44,4],[14,14,43,14]]}
[]
[]
[]
[]
[]
[]
[]
[null,null,null,null,"Project Expenses\nUpdated Budget",null,null,null,null,null,null,null,null,null,"Project Expenses \nOriginal Approved Budget"]
[]
[null,null,null,null,"HOME",null,null,null,null,null,null,null,null,null,"HOME"]
{"$rows_left_out":40}
{"sheet":"Project Budget RRH","index":8,"n_rows":30,"n_cols":20,"rows_kept":30,"cut":false,"hidden":false,"merged":[[1,1,1,9],[2,4,2,7],[1,11,1,19],[2,14,2,17],[7,3,25,3],[7,13,25,13]]}
[]
[null,"Project Expenses\nUpdated Budget",null,null,null,null,null,null,null,null,null,"Project Expenses \nOriginal Approved Budget"]
[null,"Rapid Re-housing (576.104)",null,"HOME",null,null,null,null,null,null,null,"Rapid Re-housing (576.104)",null,"HOME"]
[null,null,null,"Budget","Q-1","Q-2","Q-3","Q-4 ",null,"Total",null,null,null,"Budget","Q-1","Q-2","Q-3","Q-4 ",null,"Total"]
[null,null,null,{"$f":"E28+F28+G28+H28","v":0},null,null,null,null,null,null,null,null,null,{"$f":"O28+P28+Q28+R28","v":0}]
[null,"Housing Relocation and Stabilization Services (576.105)",null,null,null,null,null,null,null,null,null,"Housing Relocation and Stabilization Services (576.105)"]
[null,"Financial Assistance Costs",null,null,null,null,null,null,null,null,null,"Financial Assistance Costs"]
[null,"Rental application fees",null,null,0,0,0,0,null,{"$f":"E8+F8+G8+H8","v":0},null,"Rental application fees",null,null,0,0,0,0,null,{"$f":"O8+P8+Q8+R8","v":0}]
[null,"Security deposits",null,null,0,0,0,0,null,{"$f":"E9+F9+G9+H9","v":0},null,"Security deposits",null,null,0,0,0,0,null,{"$f":"O9+P9+Q9+R9","v":0}]
[null,"Last month's rent",null,null,0,0,0,0,null,0,null,"Last month's rent",null,null,0,0,0,0,null,0]
{"$rows_left_out":21}
{"sheet":"Project Budget HP","index":9,"n_rows":32,"n_cols":21,"rows_kept":32,"cut":false,"hidden":false,"merged":[[8,4,27,4],[8,14,27,14],[2,2,2,10],[3,5,3,8],[6,3,6,10],[2,12,2,20],[3,15,3,18],[6,13,6,20]]}
[]
[]
[null,null,"Project Expenses\nUpdated Budget",null,null,null,null,null,null,null,null,null,"Project Expenses \nOriginal Approved Budget"]
[null,null,"Homeless Prevention (576.103)",null,"HOME","Budget Estimates",null,null,null,null,null,null,"Homeless Prevention (576.103)",null,"HOME","Budget Estimates"]
[null,null,null,null,"Budget","Q-1","Q-2","Q-3","Q-4",null,"Total ",null,null,null,"Budget","Q-1","Q-2","Q-3","Q-4",null,"Total "]
[null,null,null,null,{"$f":"F30+G30+H30+I30","v":0},null,null,null,null,null,null,null,null,null,{"$f":"P30+Q30+R30+S30","v":0}]
[null,null,"Housing Relocation and Stabilization Services (576.105)",null,null,null,null,null,null,null,null,null,"Housing Relocation and Stabilization Services (576.105)"]
[null,null,"Financial Assistance Costs",null,null,null,null,null,null,null,null,null,"Financial Assistance Costs"]
[null,null,"Rental application fees",null,null,0,0,0,0,null,{"$f":"(F9+G9+H9+I9)","v":0},null,"Rental application fees",null,null,0,0,0,0,null,{"$f":"(P9+Q9+R9+S9)","v":0}]
[null,null,"Security deposits",null,null,0,0,0,0,null,{"$f":"(F10+G10+H10+I10)","v":0},null,"Security deposits",null,null,0,0,0,0,null,{"$f":"(P10+Q10+R10+S10)","v":0}]
{"$rows_left_out":23}
{"sheet":"Project Budget HMIS","index":10,"n_rows":19,"n_cols":20,"rows_kept":19,"cut":false,"hidden":false,"merged":[[2,4,2,7],[1,11,1,20],[2,14,2,17],[1,1,1,9],[5,3,14,3],[5,13,14,13]]}
[]
[null,"Project Expenses\nUpdated Budget",null,null,null,null,null,null,null,null,null,"Project Expenses \nOriginal Approved Budget"]
[null,"HMIS (576.107)",null,"HOME",null,null,null,null,null,null,null,"HMIS (576.107)",null,"HOME"]
[null,null,null,"Budget","Q-1","Q-2","Q-3","Q-4",null,"Total",null,null,null,"Budget","Q-1","Q-2","Q-3","Q-4",null,"Total"]
[null,"Financial Assistance Costs",null,{"$f":"E17+F17+G17+H17","v":0},null,null,null,null,null,null,null,"Financial Assistance Costs",null,{"$f":"O17+P17+Q17+R17","v":0}]
[null,"Purchasing or leasing computer hardware",null,null,0,0,0,0,null,{"$f":"(E6+F6+G6+H6)","v":0},null,"Purchasing or leasing computer hardware",null,null,0,0,0,0,null,{"$f":"(O6+P6+Q6+R6)","v":0}]
[null,"Purchasing software or software licenses",null,null,0,0,0,0,null,{"$f":"(E7+F7+G7+H7)","v":0},null,"Purchasing software or software licenses",null,null,0,0,0,0,null,{"$f":"(O7+P7+Q7+R7)","v":0}]
[null,"Purchasing or leasing equipment, including telephones, fax machines, and furniture",null,null,0,0,0,0,null,0,null,"Purchasing or leasing equipment, including telephones, fax machines, and furniture",null,null,0,0,0,0,null,0]
[null,"Obtaining technical support",null,null,0,0,0,0,null,0,null,"Obtaining technical support",null,null,0,0,0,0,null,0]
[null,"Leasing office space",null,null,0,0,0,0,null,0,null,"Leasing office space",null,null,0,0,0,0,null,0]
{"$rows_left_out":10}
{"sheet":"Wage & Fringe","index":11,"n_rows":28,"n_cols":25,"rows_kept":28,"cut":false,"hidden":false,"merged":[[3,2,3,10],[4,1,4,12],[4,14,4,24],[7,16,7,24],[19,1,19,12]]}
[]
[]
[null,null,null,null,null,null,null,null,null,null,null,null,null,null,null,null,null,null,null,null,null,null,"<<Go Back "]
[null,"Agency Name: "]
[null,"Wage Information for the FY 2025 Grants",null,null,null,null,null,null,null,null,null,null,null,null,"In the chart below, place an X by the employer paid benefits that are included each listed employee's fringe rate.   "]
[null,"Staff Name","Title","Indicate If Hourly or Salary","Hourly Rate","Fringe Rate","Hours  HOPWA","Hours ESG","Hours CHOICE","Hours HOME-ARP","Hours Other","Effective Date","Good through Date",null,"Employee Name: ",null,{"$f":"B7","v":0},{"$f":"B8","v":0},{"$f":"B9","v":0},{"$f":"B10","v":0},{"$f":"B11","v":0},{"$f":"B12","v":0},{"$f":"B13","v":0},{"$f":"B14","v":0},{"$f":"B16","v":0}]
[1,null,null,null,null,null,null,null,null,null,{"$f":"SUM(E7:F7)","v":0},null,null,null,"Reported Hourly Fringe Rate: ",null,{"$f":"F7","v":0},{"$f":"F8","v":0},{"$f":"F9","v":0},{"$f":"F10","v":0},{"$f":"F11","v":0},{"$f":"F12","v":0},{"$f":"F13","v":0},{"$f":"F14","v":0},{"$f":"F16","v":0}]
[2,null,null,null,null,null,null,null,null,null,{"$f":"SUM(E8:F8)","v":0},null,null,null,"Employer Paid Benefits"]
[3,null,null,null,null,null,null,null,null,null,{"$f":"SUM(E9:F9)","v":0},null,null,null,"    FICA  "]
[4,null,null,null,null,null,null,null,null,null,0,null,null,null,"Health Insurance  "]
{"$rows_left_out":19}
{"sheet":"Staff#1","index":12,"n_rows":33,"n_cols":19,"rows_kept":33,"cut":false,"hidden":false,"merged":[[2,1,2,17],[3,1,3,17],[5,2,5,8],[6,2,6,8],[6,10,6,12],[6,13,6,14],[10,1,10,18],[7,2,7,4],[7,6,7,8],[7,10,7,12],[7,13,7,14],[8,2,8,4],[8,6,8,8]]}
[]
[]
[null,"Agency Name"]
[null,"Bi-Weekly Timesheet"]
[null,null,null,null,null,null,null,null,null,null,null,null,null,null,null,null,null,null,"<<Go Back "]
[null,"Employee:"]
[null,"Employee Title: ",null,null,null,null,null,null,null,null,"Scheduled Hours: ",null,null,{"$f":"R31","v":0}]
[null,null,null,null,null,null,null,null,null,null,"Hours Worked: ",null,null,{"$f":"R31","v":0}]
[]
[]
{"$rows_left_out":24}
{"sheet":"Staff#2","index":13,"n_rows":33,"n_cols":19,"rows_kept":33,"cut":false,"hidden":false,"merged":[[2,1,2,17],[3,1,3,17],[5,2,5,8],[6,2,6,8],[6,10,6,12],[6,13,6,14],[10,1,10,18],[7,2,7,4],[7,6,7,8],[7,10,7,12],[7,13,7,14],[8,2,8,4],[8,6,8,8]]}
[]
[]
[null,"Agency Name"]
[null,"Bi-Weekly Timesheet"]
[null,null,null,null,null,null,null,null,null,null,null,null,null,null,null,null,null,null,"<<Go Back "]
[null,"Employee:"]
[null,"Employee Title: ",null,null,null,null,null,null,null,null,"Scheduled Hours: ",null,null,{"$f":"R31","v":0}]
[null,null,null,null,null,null,null,null,null,null,"Hours Worked: ",null,null,{"$f":"R31","v":0}]
[]
[]
{"$rows_left_out":24}
{"sheet":"Staff#3","index":14,"n_rows":33,"n_cols":19,"rows_kept":33,"cut":false,"hidden":false,"merged":[[2,1,2,17],[3,1,3,17],[5,2,5,8],[6,2,6,8],[6,10,6,12],[6,13,6,14],[10,1,10,18],[7,2,7,4],[7,6,7,8],[7,10,7,12],[7,13,7,14],[8,2,8,4],[8,6,8,8]]}
[]
[]
[null,"Agency Name"]
[null,"Bi-Weekly Timesheet"]
[null,null,null,null,null,null,null,null,null,null,null,null,null,null,null,null,null,null,"<<Go Back "]
[null,"Employee:"]
[null,"Employee Title: ",null,null,null,null,null,null,null,null,"Scheduled Hours: ",null,null,{"$f":"R31","v":0}]
[null,null,null,null,null,null,null,null,null,null,"Hours Worked: ",null,null,{"$f":"R31","v":0}]
[]
[]
{"$rows_left_out":24}
{"sheet":"Staff#4","index":15,"n_rows":33,"n_cols":19,"rows_kept":33,"cut":false,"hidden":false,"merged":[[2,1,2,17],[3,1,3,17],[5,2,5,8],[6,2,6,8],[6,10,6,12],[6,13,6,14],[10,1,10,18],[7,2,7,4],[7,6,7,8],[7,10,7,12],[7,13,7,14],[8,2,8,4],[8,6,8,8]]}
[]
[]
[null,"Agency Name"]
[null,"Bi-Weekly Timesheet"]
[null,null,null,null,null,null,null,null,null,null,null,null,null,null,null,null,null,null,"<<Go Back "]
[null,"Employee:"]
[null,"Employee Title: ",null,null,null,null,null,null,null,null,"Scheduled Hours: ",null,null,{"$f":"R31","v":0}]
[null,null,null,null,null,null,null,null,null,null,"Hours Worked: ",null,null,{"$f":"R31","v":0}]
[]
[]
{"$rows_left_out":24}
{"sheet":"Staff#5","index":16,"n_rows":34,"n_cols":19,"rows_kept":34,"cut":false,"hidden":false,"merged":[[2,1,2,17],[3,1,3,17],[5,2,5,8],[6,2,6,8],[6,10,6,12],[6,13,6,14],[10,1,10,18],[7,2,7,4],[7,6,7,8],[7,10,7,12],[7,13,7,14],[8,2,8,4],[8,6,8,8]]}
[]
[]
[null,"Agency Name"]
[null,"Bi-Weekly Timesheet"]
[null,null,null,null,null,null,null,null,null,null,null,null,null,null,null,null,null,null,"<<Go Back "]
[null,"Employee:"]
[null,"Employee Title: ",null,null,null,null,null,null,null,null,"Scheduled Hours: ",null,null,{"$f":"R32","v":0}]
[null,null,null,null,null,null,null,null,null,null,"Hours Worked: ",null,null,{"$f":"R32","v":0}]
[]
[]
{"$rows_left_out":25}
{"sheet":"Staff#6","index":17,"n_rows":34,"n_cols":19,"rows_kept":34,"cut":false,"hidden":false,"merged":[[2,1,2,17],[3,1,3,17],[5,2,5,8],[6,2,6,8],[6,10,6,12],[6,13,6,14],[10,1,10,18],[7,2,7,4],[7,6,7,8],[7,10,7,12],[7,13,7,14],[8,2,8,4],[8,6,8,8]]}
[]
[]
[null,"Agency Name"]
[null,"Bi-Weekly Timesheet"]
[null,null,null,null,null,null,null,null,null,null,null,null,null,null,null,null,null,null,"<<Go Back "]
[null,"Employee:"]
[null,"Employee Title: ",null,null,null,null,null,null,null,null,"Scheduled Hours: ",null,null,{"$f":"R32","v":0}]
[null,null,null,null,null,null,null,null,null,null,"Hours Worked: ",null,null,{"$f":"R32","v":0}]
[]
[]
{"$rows_left_out":25}
{"sheet":"Staff#7","index":18,"n_rows":34,"n_cols":19,"rows_kept":34,"cut":false,"hidden":false,"merged":[[2,1,2,17],[3,1,3,17],[5,2,5,8],[6,2,6,8],[6,10,6,12],[6,13,6,14],[10,1,10,18],[7,2,7,4],[7,6,7,8],[7,10,7,12],[7,13,7,14],[8,2,8,4],[8,6,8,8]]}
[]
[]
[null,"Agency Name"]
[null,"Bi-Weekly Timesheet"]
[null,null,null,null,null,null,null,null,null,null,null,null,null,null,null,null,null,null,"<<Go Back "]
[null,"Employee:"]
[null,"Employee Title: ",null,null,null,null,null,null,null,null,"Scheduled Hours: ",null,null,{"$f":"R32","v":0}]
[null,null,null,null,null,null,null,null,null,null,"Hours Worked: ",null,null,{"$f":"R32","v":0}]
[]
[]
{"$rows_left_out":25}
{"sheet":"Staff#8","index":19,"n_rows":34,"n_cols":19,"rows_kept":34,"cut":false,"hidden":false,"merged":[[2,1,2,17],[3,1,3,17],[5,2,5,8],[6,2,6,8],[6,10,6,12],[6,13,6,14],[10,1,10,18],[7,2,7,4],[7,6,7,8],[7,10,7,12],[7,13,7,14],[8,2,8,4],[8,6,8,8]]}
[]
[]
[null,"Agency Name"]
[null,"Bi-Weekly Timesheet"]
[null,null,null,null,null,null,null,null,null,null,null,null,null,null,null,null,null,null,"<<Go Back "]
[null,"Employee:"]
[null,"Employee Title: ",null,null,null,null,null,null,null,null,"Scheduled Hours: ",null,null,{"$f":"R32","v":0}]
[null,null,null,null,null,null,null,null,null,null,"Hours Worked: ",null,null,{"$f":"R32","v":0}]
[]
[]
{"$rows_left_out":25}
{"sheet":"Staff#9","index":20,"n_rows":34,"n_cols":19,"rows_kept":34,"cut":false,"hidden":false,"merged":[[2,1,2,17],[3,1,3,17],[5,2,5,8],[6,2,6,8],[6,10,6,12],[6,13,6,14],[10,1,10,18],[7,2,7,4],[7,6,7,8],[7,10,7,12],[7,13,7,14],[8,2,8,4],[8,6,8,8]]}
[]
[]
[null,"Agency Name"]
[null,"Bi-Weekly Timesheet"]
[null,null,null,null,null,null,null,null,null,null,null,null,null,null,null,null,null,null,"<<Go Back "]
[null,"Employee:"]
[null,"Employee Title: ",null,null,null,null,null,null,null,null,"Scheduled Hours: ",null,null,{"$f":"R32","v":0}]
[null,null,null,null,null,null,null,null,null,null,"Hours Worked: ",null,null,{"$f":"R32","v":0}]
[]
[]
{"$rows_left_out":25}
{"sheet":"Staff#10","index":21,"n_rows":34,"n_cols":19,"rows_kept":34,"cut":false,"hidden":false,"merged":[[2,1,2,17],[3,1,3,17],[5,2,5,8],[6,2,6,8],[6,10,6,12],[6,13,6,14],[10,1,10,18],[7,2,7,4],[7,6,7,8],[7,10,7,12],[7,13,7,14],[8,2,8,4],[8,6,8,8]]}
[]
[]
[null,"Agency Name"]
[null,"Bi-Weekly Timesheet"]
[null,null,null,null,null,null,null,null,null,null,null,null,null,null,null,null,null,null,"<<Go Back "]
[null,"Employee:"]
[null,"Employee Title: ",null,null,null,null,null,null,null,null,"Scheduled Hours: ",null,null,{"$f":"R32","v":0}]
[null,null,null,null,null,null,null,null,null,null,"Hours Worked: ",null,null,{"$f":"R32","v":0}]
[]
[]
{"$rows_left_out":25}
{"sheet":"Equipment Disposition Request","index":22,"n_rows":33,"n_cols":11,"rows_kept":33,"cut":false,"hidden":false,"merged":[[11,6,11,7],[6,2,6,11],[7,9,9,9],[7,10,8,10],[8,4,8,5],[10,6,10,7],[28,6,28,7],[29,6,29,7],[30,6,30,7],[31,6,31,7],[32,3,32,7]]}
[]
[]
[]
[]
[null,null,null,null,null,null,null,null,null,null,"<<Go Back "]
[]
[]
[null,null,null,null,null,null,null,null,null,"Total Charged to the Grant:"]
[null,null,null,null,"Total Cost:",null,{"$f":"I33","v":0}]
[null,null,"      ",null,null,null,null,null,null,null,{"$f":"J12+J29+J30+J31+J32","v":0}]
{"$rows_left_out":23}